{"text_format":"2","workbook":"xlsx","n_sheets":12,"sheets":["Cover","Contents","Table1_data","Table 1","Table2_data","Table 2","Table 3a","Table3b_data","Table 3b","Table 4","Chart 1","Chart 2"],"not_rendered":{"charts":4,"images":1,"macros":0,"external_links":7,"defined_names":46,"comments":1,"pivot_tables":0},"unopened":[],"bounds":{"document_bytes":16777216,"sheet_cells":100000,"run_cost":"one","rows_first":2000,"rows_last":500,"rows_between":2000,"halvings":0,"cell_chars":16384,"cell_head_chars":4096},"cells_cut":0,"cells_raw":0,"read":"whole","date_system":"1900"}

{"sheet":"Cover","index":0,"n_rows":33,"n_cols":3,"rows_kept":33,"cut":false,"hidden":false,"merged":[[5,1,5,2],[12,1,15,1],[12,2,15,2],[26,1,27,2],[0,1,0,2]]}
[]
[]
[]
[]
[]
[null,"Official Statistics Release"]
[null,"Policy area:","Independent schools inspections and outcomes, including regulation and compliance"]
[null,"Theme:","Education, children's services and skills"]
[null,"Published on:","2012-11-27"]
[null,"Coverage:","England"]
[null,"Period covered:","1 September 2011 to 31 August 2012"]
[null,"Status:","FINAL"]
[null,"Issued by:","Office for Standards in Education, Children's Services and Services and Skills (Ofsted)\n125 Aviation House\nLondon\nWC2B 6SE"]
[]
[]
{"$rows_left_out":19}
{"sheet":"Contents","index":1,"n_rows":15,"n_cols":2,"rows_kept":15,"cut":false,"hidden":false,"merged":[[13,1,13,11],[14,1,14,12],[5,1,5,13],[6,1,6,13],[7,1,7,17],[8,1,8,11],[11,1,11,6],[9,1,9,11]]}
[]
[null,"Contents"]
[]
[null,"Tables"]
[]
[null,"Table 1: Number of inspections carried out in non-association independent schools inspected between 1 September 2011 and 31 August 2012, by type (final)"]
[null,"Table 2: Inspection outcomes for non-association independent schools inspected between 1 September 2011 and 31 August 2012 (final)"]
[null,"Table 3a: Overall performance on compliance with regulatory requirements for non-association independent schools inspected between 1 September 2011 and 31 August 2012 (final)"]
[null,"Table 3b: Compliance with regulatory requirements for non-association independent schools inspected between 1 September 2011 - 31 August 2012 (final)"]
[null,"Table 4: Inspection outcomes for selected judgements of non-association independent schools inspected at their most recent inspection at 31 August 2012 (final)"]
[]
[null,"Charts"]
[]
[null,"Chart 1: Overall quality of education for non-association independent schools inspected between 1 September 2008 and 31 August 2012 (final)"]
[null,"Chart 2: Overall performance on compliance with regulations by non-association independent schools inspected between 1 September 2008 and 31 August 2012 (final)"]
{"$rows_left_out":1}
{"sheet":"Table1_data","index":2,"n_rows":17,"n_cols":6,"rows_kept":17,"cut":false,"hidden":true,"merged":[]}
["Table 1"]
["Event Type","Count of events\n"]
["S162a - Integrated Inspection",52,null,null,"Pre-registration inspection (Independent school)",{"$f":"B11+B13","v":137}]
["S162a First Inspection",28,null,null,"Pre-registration inspection (Academy)",{"$f":"B7","v":83}]
["S162a First Integrated Inspection",4,null,null,"Full inspection1",{"$f":"B3+B4+B5+B6","v":361}]
["S162a Inspection",277,null,null,"Progress monitoring inspection",{"$f":"B14+B15","v":98}]
["Independent Academy Registration Visit",83,null,null,"Emergency inspection",{"$f":"B8+B9","v":42}]
["Independent DfES Emergency",39,null,null,"Material change inspection",{"$f":"B10+B12","v":67}]
["Independent Integrated DfES Emergency",3]
["Independent Integrated Material Change",4,null,null,"Total",{"$f":"SUM(F3:F8)","v":788}]
["Independent Integrated Pre-Registration Visit",9]
["Independent Material Change",63]
["Independent Pre-registration Visit",128]
["S162a Follow-up Visit",88]
["S162a Integrated Follow-up Visit",10]
{"$rows_left_out":3}
{"sheet":"Table 1","index":3,"n_rows":14,"n_cols":6,"rows_kept":14,"cut":false,"hidden":false,"merged":[[9,5,9,7],[3,5,3,7],[6,5,6,7],[10,5,10,7],[11,4,11,7],[4,5,4,7],[5,5,5,7],[7,5,7,7],[8,5,8,7]]}
[]
[null,null,null,"Table 1: Number of inspections carried out in non-association independent schools inspected between 1 September 2011 and 31 August 2012, by type (final) ¹ ²"]
[]
[null,null,null,"Inspection activity",null,"Number"]
["Independent Pre-registration Visit","Independent Integrated Pre-Registration Visit",null,"Pre-registration inspection (Independent school)",null,{"$f":"VLOOKUP(D5,Table1_data!$E$3:$F$8,2,FALSE)","v":137}]
["Independent Academy Registration Visit",null,null,"Pre-registration inspection (Academy)",null,{"$f":"VLOOKUP(D6,Table1_data!$E$3:$F$8,2,FALSE)","v":83}]
["S162a - Integrated Inspection","S162a Inspection",null,"Full inspection1",null,{"$f":"VLOOKUP(D7,Table1_data!$E$3:$F$8,2,FALSE)","v":361}]
["S162a Follow-up Visit","S162a Integrated Follow-up Visit",null,"Progress monitoring inspection",null,{"$f":"VLOOKUP(D8,Table1_data!$E$3:$F$8,2,FALSE)","v":98}]
["Independent DfES Emergency","Independent Integrated DfES Emergency",null,"Emergency inspection",null,{"$f":"VLOOKUP(D9,Table1_data!$E$3:$F$8,2,FALSE)","v":42}]
["Independent Material Change","Independent Integrated Material Change",null,"Material change inspection",null,{"$f":"VLOOKUP(D10,Table1_data!$E$3:$F$8,2,FALSE)","v":67}]
[null,null,null,"Total",null,{"$f":"SUM(F5:H10)","v":788}]
[{"$nulls":4},"Source: Ofsted inspections"]
[null,null,null,"1. Numbers of each inspection type will include both education only and integrated inspections."]
[null,null,null,"2. Figures represent the number of independent schools."]

{"sheet":"Table2_data","index":4,"n_rows":18,"n_cols":9,"rows_kept":18,"cut":false,"hidden":true,"merged":[[31,4,32,4],[31,5,32,5],[31,0,32,0],[31,1,32,1],[31,2,32,2],[31,3,32,3]]}
["Table 2"]
["Question Text","Total","Outstanding","Good","Satisfactory","Inadequate"]
["Overall quality of education",361,48,228,74,11]
["How well the curriculum and other activities meet the range of needs and interests of pupils",361,65,211,73,12]
["How effective teaching and assessment are in meeting the full range of pupils' needs",361,43,235,72,11]
["How well pupils make progress in their learning",361,47,230,73,11]
["Quality of provision for pupils' spiritual, moral, social and cultural development",361,127,189,40,5]
["The behaviour of pupils",361,131,190,35,5]
["The overall welfare, health and safety of pupils",361,96,177,56,32]
["Outcomes for children in the Early Years Foundation Stage",52,7,36,8,1]
["The quality of provision in the Early Years Foundation Stage",52,7,32,10,3]
["The effectiveness of leadership and management of the Early Years Foundation Stage",52,8,32,5,7]
["Overall effectiveness of the Early Years Foundation stage",52,7,32,6,7]
["Overall effectiveness of boarding / residential experience",{"$f":"SUM(C14:F14)","v":21},{"$f":"COUNTIF([7]ALL_RAW_DATA!$V$6:$V$994,\"1\")","v":9},{"$f":"COUNTIF([7]ALL_RAW_DATA!$V$6:$V$994,\"2\")","v":4},{"$f":"COUNTIF([7]ALL_RAW_DATA!$V$6:$V$994,\"3\")","v":4},{"$f":"COUNTIF([7]ALL_RAW_DATA!$V$6:$V$994,4)","v":4},null,null,"Boarding/residential data taken from October MI"]
["Outcomes for boarders / residential pupils",{"$f":"SUM(C15:F15)","v":21},{"$f":"COUNTIF([7]ALL_RAW_DATA!$W$6:$W$994,\"1\")","v":11},{"$f":"COUNTIF([7]ALL_RAW_DATA!$W$6:$W$994,2)","v":9},{"$f":"COUNTIF([7]ALL_RAW_DATA!$W$6:$W$994,3)","v":0},{"$f":"COUNTIF([7]ALL_RAW_DATA!$W$6:$W$994,4)","v":1}]
{"$rows_left_out":4}
{"sheet":"Table 2","index":5,"n_rows":28,"n_cols":17,"rows_kept":28,"cut":false,"hidden":false,"merged":[[9,1,9,7],[14,1,14,7],[19,1,19,6],[4,9,4,10],[4,8,5,8],[7,1,7,7],[23,14,23,16],[11,1,11,7],[12,1,12,7],[13,1,13,7],[22,1,22,6],[16,1,16,7],[4,15,4,16],[21,1,21,6],[15,1,15,7],[18,1,18,6],[8,1,8,7],[17,1,17,7],[20,1,20,6],[4,11,4,12],[4,13,4,14],[10,1,10,7]]}
[]
[null,"Table 2: Inspection outcomes for non-association independent schools inspected between 1 September 2011 and 31 August 2012 (final) 1 2 3 4"]
[]
[]
[{"$nulls":8},"Total number inspected","Outstanding",null,"Good","Good","Satisfactory","Satisfactory","Inadequate","Inadequate"]
[{"$nulls":9},"Number","%","Number","%","Number","%","Number","%"]
[]
[null,"Overall quality of education",{"$nulls":6},{"$f":"J8+L8+N8+P8","v":361},{"$f":"VLOOKUP(B8,Table2_data!$A$3:$F$18,3,FALSE)","v":48},{"$f":"J8/$I8*100","v":13.29639889196676},{"$f":"VLOOKUP(B8,Table2_data!$A$3:$F$18,4,FALSE)","v":228},{"$f":"L8/$I8*100","v":63.157894736842103},{"$f":"VLOOKUP(B8,Table2_data!$A$3:$F$18,5,FALSE)","v":74},{"$f":"N8/$I8*100","v":20.498614958448755},{"$f":"VLOOKUP(B8,Table2_data!$A$3:$F$18,6,FALSE)","v":11},{"$f":"P8/$I8*100","v":3.0470914127423825}]
[null,"How well the curriculum and other activities meet the range of needs and interests of pupils",{"$nulls":6},361,{"$f":"VLOOKUP(B9,Table2_data!$A$3:$F$18,3,FALSE)","v":65},{"$f":"J9/$I9*100","v":18.005540166204987},{"$f":"VLOOKUP(B9,Table2_data!$A$3:$F$18,4,FALSE)","v":211},58.448753462603875,{"$f":"VLOOKUP(B9,Table2_data!$A$3:$F$18,5,FALSE)","v":73},20.221606648199447,{"$f":"VLOOKUP(B9,Table2_data!$A$3:$F$18,6,FALSE)","v":12},3.32409972299169]
[null,"How effective teaching and assessment are in meeting the full range of pupils' needs",{"$nulls":6},361,{"$f":"VLOOKUP(B10,Table2_data!$A$3:$F$18,3,FALSE)","v":43},11.911357340720222,{"$f":"VLOOKUP(B10,Table2_data!$A$3:$F$18,4,FALSE)","v":235},65.096952908587255,{"$f":"VLOOKUP(B10,Table2_data!$A$3:$F$18,5,FALSE)","v":72},19.94459833795014,{"$f":"VLOOKUP(B10,Table2_data!$A$3:$F$18,6,FALSE)","v":11},3.0470914127423825]
[null,"How well pupils make progress in their learning",{"$nulls":6},361,{"$f":"VLOOKUP(B11,Table2_data!$A$3:$F$18,3,FALSE)","v":47},13.019390581717452,{"$f":"VLOOKUP(B11,Table2_data!$A$3:$F$18,4,FALSE)","v":230},63.711911357340725,{"$f":"VLOOKUP(B11,Table2_data!$A$3:$F$18,5,FALSE)","v":73},20.221606648199447,{"$f":"VLOOKUP(B11,Table2_data!$A$3:$F$18,6,FALSE)","v":11},3.0470914127423825]
[null,"Quality of provision for pupils' spiritual, moral, social and cultural development",{"$nulls":6},361,{"$f":"VLOOKUP(B12,Table2_data!$A$3:$F$18,3,FALSE)","v":127},35.180055401662052,{"$f":"VLOOKUP(B12,Table2_data!$A$3:$F$18,4,FALSE)","v":189},52.35457063711911,{"$f":"VLOOKUP(B12,Table2_data!$A$3:$F$18,5,FALSE)","v":40},11.080332409972298,{"$f":"VLOOKUP(B12,Table2_data!$A$3:$F$18,6,FALSE)","v":5},1.3850415512465373]
[null,"The behaviour of pupils",{"$nulls":6},361,{"$f":"VLOOKUP(B13,Table2_data!$A$3:$F$18,3,FALSE)","v":131},36.288088642659275,{"$f":"VLOOKUP(B13,Table2_data!$A$3:$F$18,4,FALSE)","v":190},52.631578947368418,{"$f":"VLOOKUP(B13,Table2_data!$A$3:$F$18,5,FALSE)","v":35},9.6952908587257625,{"$f":"VLOOKUP(B13,Table2_data!$A$3:$F$18,6,FALSE)","v":5},1.3850415512465373]
[null,"The overall welfare, health and safety of pupils",{"$nulls":6},361,{"$f":"VLOOKUP(B14,Table2_data!$A$3:$F$18,3,FALSE)","v":96},26.59279778393352,{"$f":"VLOOKUP(B14,Table2_data!$A$3:$F$18,4,FALSE)","v":177},49.03047091412742,{"$f":"VLOOKUP(B14,Table2_data!$A$3:$F$18,5,FALSE)","v":56},15.512465373961218,{"$f":"VLOOKUP(B14,Table2_data!$A$3:$F$18,6,FALSE)","v":32},8.86426592797784]
[null,"Outcomes for children in the Early Years Foundation Stage",{"$nulls":6},52,{"$f":"VLOOKUP(B15,Table2_data!$A$3:$F$18,3,FALSE)","v":7},13.461538461538462,{"$f":"VLOOKUP(B15,Table2_data!$A$3:$F$18,4,FALSE)","v":36},69.230769230769226,{"$f":"VLOOKUP(B15,Table2_data!$A$3:$F$18,5,FALSE)","v":8},15.384615384615385,{"$f":"VLOOKUP(B15,Table2_data!$A$3:$F$18,6,FALSE)","v":1},1.9230769230769231]
{"$rows_left_out":14}
{"sheet":"Table 3a","index":6,"n_rows":18,"n_cols":14,"rows_kept":18,"cut":false,"hidden":false,"merged":[[11,1,11,6],[12,1,12,6],[13,1,13,6],[14,1,14,6],[16,12,16,13],[7,1,7,6],[4,8,5,8],[15,1,15,6],[8,1,8,6],[9,1,9,6],[10,1,10,6]]}
[]
[null,"Table 3a: Overall performance on compliance with regulatory requirements for non-association independent schools inspected between 1 September 2011 and 31 August 2012 (final) ¹"]
[]
[]
[{"$nulls":8},"Total number inspected",1,"90-99%","70-89%","50-69%","<50%"]
[{"$nulls":9},"Number","Number","Number","Number","Number"]
[]
[null,"All Regulations",{"$nulls":6},361,217,118,25,1,0]
[null,"Quality of education provided",{"$nulls":6},361,319,10,23,4,5]
[null,"Quality of teaching and assessment",{"$nulls":6},361,331,0,15,6,9]
[null,"Spiritual, moral, social and cultural education of pupils",{"$nulls":6},361,350,0,4,3,4]
[null,"Welfare, health and safety of pupils",{"$nulls":6},361,279,41,22,18,1]
[null,"Suitability of the proprietor, staff and supply staff",{"$nulls":6},361,339,7,10,4,1]
[null,"Premises and accommodation of schools",{"$nulls":6},361,296,56,9,0,0]
[null,"Provision of information for parents, carers and others",{"$nulls":6},361,306,0,45,10,0]
{"$rows_left_out":4}
{"sheet":"Table3b_data","index":7,"n_rows":132,"n_cols":7,"rows_kept":132,"cut":false,"hidden":true,"merged":[[389,5,390,5],[389,6,390,6],[389,0,390,0],[389,2,390,2],[389,3,390,3],[389,4,390,4]]}
["Table 3b"]
["Question Code","Lookup","Total number inspected","Met","Not Met","Not applicable","Not checked"]
["1--0",1,361,0,0,0,361]
["10--0",10,361,253,12,96,0]
["100--0",100,361,0,0,0,361]
["101--0",101,361,0,0,0,361]
["102--0",102,361,345,16,0,0]
["103--0",103,361,0,0,0,361]
["104--0",104,361,329,32,0,0]
["105--0",105,361,349,12,0,0]
["106--0",106,361,360,1,0,0]
["107--0",107,361,43,1,317,0]
["108--0",108,361,355,6,0,0]
["109--0",109,361,361,0,0,0]
["11--0",11,361,110,0,251,0]
{"$rows_left_out":118}
{"sheet":"Table 3b","index":8,"n_rows":122,"n_cols":12,"rows_kept":122,"cut":false,"hidden":false,"merged":[[118,1,120,11],[4,9,5,9],[4,10,5,10],[4,11,5,11],[99,1,99,6],[111,1,111,6],[110,1,110,6],[109,1,109,6],[103,1,103,6],[113,1,116,11],[90,1,90,6],[91,1,91,6],[96,1,96,6],[92,1,92,6],[93,1,93,6],[94,1,94,6],[95,1,95,6],[89,1,89,6],[85,1,85,6],[76,1,76,6],[77,1,77,6],[78,1,78,6],[71,1,71,6],[72,1,72,6],[73,1,73,6],[74,1,74,6],[75,1,75,6],[4,8,5,8],[86,1,86,6],[87,1,87,6],[88,1,88,6],[79,1,79,6],[80,1,80,6],[81,1,81,6],[82,1,82,6],[83,1,83,6],[84,1,84,6],[67,1,67,6],[68,1,68,6],[69,1,69,6],[70,1,70,6],[63,1,63,6],[64,1,64,6],[65,1,65,6],[66,1,66,6],[59,1,59,6],[60,1,60,6],[61,1,61,6],[62,1,62,6],[55,1,55,6],[56,1,56,6],[57,1,57,6],[58,1,58,6],[51,1,51,6],[52,1,52,6],[53,1,53,6],[54,1,54,6],[47,1,47,6],[48,1,48,6],[49,1,49,6],[50,1,50,6],[43,1,43,6],[44,1,44,6],[45,1,45,6],[46,1,46,6],[39,1,39,6],[40,1,40,6],[41,1,41,6],[42,1,42,6],[35,1,35,6],[36,1,36,6],[37,1,37,6],[38,1,38,6],[31,1,31,6],[32,1,32,6],[33,1,33,6],[34,1,34,6],[27,1,27,6],[28,1,28,6],[29,1,29,6],[30,1,30,6],[23,1,23,6],[24,1,24,6],[25,1,25,6],[26,1,26,6],[19,1,19,6],[20,1,20,6],[21,1,21,6],[22,1,22,6],[15,1,15,6],[16,1,16,6],[17,1,17,6],[18,1,18,6],[11,1,11,6],[12,1,12,6],[13,1,13,6],[14,1,14,6],[7,1,7,6],[8,1,8,6],[9,1,9,6],[10,1,10,6],[100,1,100,6],[108,1,108,6],[98,1,98,6],[97,1,97,6],[102,1,102,6],[101,1,101,6],[104,1,104,6],[107,1,107,6],[106,1,106,6],[105,1,105,6]]}
[]
[null,"Table 3b: Compliance with regulatory requirements for non-association independent schools inspected between 1 September 2011 - 31 August 2012 (final) 1 2 3 4 "]
[]
[]
[{"$nulls":8},"Total number inspected","Met","Not met","Not applicable"]
[]
[]
[null,"Quality of education provided"]
[3,"2(1) : Is there a curriculum policy set out in writing which is supported by appropriate plans and schemes of work, and does it implement it effectively? (Please note that this regulation is only met if the regulations 2(2)(a-j), below, are fully met.)",{"$nulls":6},{"$f":"J9+K9+L9","v":361},{"$f":"VLOOKUP(A9,Table3b_data!$B$3:$G$132,3,FALSE)","v":322},{"$f":"VLOOKUP(A9,Table3b_data!$B$3:$G$132,4,FALSE)","v":39},{"$f":"VLOOKUP(A9,Table3b_data!$B$3:$G$132,5,FALSE)","v":0}]
[4,"2(2)(a) : Does the curriculum give pupils of compulsory school age a full time education with experience in the following areas of learning: linguistic, mathematical, scientific, technological, human and social, physical, and aesthetic and creative?",{"$nulls":6},361,{"$f":"VLOOKUP(A10,Table3b_data!$B$3:$G$132,3,FALSE)","v":344},{"$f":"VLOOKUP(A10,Table3b_data!$B$3:$G$132,4,FALSE)","v":17},{"$f":"VLOOKUP(A10,Table3b_data!$B$3:$G$132,5,FALSE)","v":0}]
[5,"2(2)(b) : Is the subject matter appropriate for the ages and aptitudes of pupils, including those pupils with a statement of special educational needs?",{"$nulls":6},361,{"$f":"VLOOKUP(A11,Table3b_data!$B$3:$G$132,3,FALSE)","v":353},{"$f":"VLOOKUP(A11,Table3b_data!$B$3:$G$132,4,FALSE)","v":8},{"$f":"VLOOKUP(A11,Table3b_data!$B$3:$G$132,5,FALSE)","v":0}]
[6,"2(2)(c) : Does the curriculum enable pupils to acquire skills in speaking, listening, literacy and numeracy?",{"$nulls":6},361,{"$f":"VLOOKUP(A12,Table3b_data!$B$3:$G$132,3,FALSE)","v":357},{"$f":"VLOOKUP(A12,Table3b_data!$B$3:$G$132,4,FALSE)","v":4},{"$f":"VLOOKUP(A12,Table3b_data!$B$3:$G$132,5,FALSE)","v":0}]
[7,"2(2)(d) : If the principal language of instruction is a language other than English, does the school provide lessons in written and spoken English? (Please note that this requirement does not apply in respect of a school which provides education for pupils who are all temporarily resident in England and which follows the curriculum of another country.) ",{"$nulls":6},361,{"$f":"VLOOKUP(A13,Table3b_data!$B$3:$G$132,3,FALSE)","v":13},{"$f":"VLOOKUP(A13,Table3b_data!$B$3:$G$132,4,FALSE)","v":1},{"$f":"VLOOKUP(A13,Table3b_data!$B$3:$G$132,5,FALSE)","v":347}]
[8,"2(2)(e) : Where pupils have a statement of special educational needs does the education provided fulfil its requirements?",{"$nulls":6},361,{"$f":"VLOOKUP(A14,Table3b_data!$B$3:$G$132,3,FALSE)","v":225},{"$f":"VLOOKUP(A14,Table3b_data!$B$3:$G$132,4,FALSE)","v":13},{"$f":"VLOOKUP(A14,Table3b_data!$B$3:$G$132,5,FALSE)","v":123}]
[9,"2(2)(f) : Is provision made for personal, social and health education which reflects the school’s aims and ethos?",{"$nulls":6},361,{"$f":"VLOOKUP(A15,Table3b_data!$B$3:$G$132,3,FALSE)","v":355},{"$f":"VLOOKUP(A15,Table3b_data!$B$3:$G$132,4,FALSE)","v":6},{"$f":"VLOOKUP(A15,Table3b_data!$B$3:$G$132,5,FALSE)","v":0}]
{"$rows_left_out":108}
{"sheet":"Table 4","index":9,"n_rows":19,"n_cols":17,"rows_kept":19,"cut":false,"hidden":false,"merged":[[15,14,15,16],[8,1,8,7],[9,1,9,7],[10,1,10,7],[11,1,11,7],[12,1,12,7],[13,1,13,7],[4,9,4,10],[4,11,4,12],[4,13,4,14],[4,15,4,16],[4,8,5,8],[7,1,7,7]]}
[]
[null,"Table 4: Inspection outcomes for selected judgements of non-association independent schools inspected at their most recent inspection at 31 August 2012 (final) 1 2 3"]
[]
[]
[{"$nulls":8},"Total open schools","Outstanding",null,"Good","Good","Satisfactory","Satisfactory","Inadequate","Inadequate"]
[{"$nulls":9},"Number","%","Number","%","Number","%","Number","%"]
[]
[null,"Overall quality of education",{"$nulls":6},{"$f":"J8+L8+N8+P8","v":1015},128,{"$f":"J8/I8*100","v":12.610837438423644},610,{"$f":"L8/$I8*100","v":60.098522167487687},254,{"$f":"N8/$I8*100","v":25.024630541871922},23,{"$f":"P8/$I8*100","v":2.2660098522167487}]
[null,"How well the curriculum and other activities meet the range of needs and interests of pupils",{"$nulls":6},1016,150,{"$f":"J9/I9*100","v":14.763779527559054},575,{"$f":"L9/$I9*100","v":56.594488188976378},262,25.787401574803148,29,2.8543307086614176]
[null,"How effective teaching and assessment are in meeting the full range of pupils' needs",{"$nulls":6},1015,100,9.8522167487684733,639,62.955665024630548,257,25.320197044334975,19,1.87192118226601]
[null,"How well pupils make progress in their learning",{"$nulls":6},1016,131,12.893700787401574,615,60.531496062992133,249,24.507874015748033,21,2.066929133858268]
[null,"Quality of provision for pupils' spiritual, moral, social and cultural development",{"$nulls":6},1016,364,35.826771653543304,503,49.50787401574803,136,13.385826771653544,13,1.2795275590551181]
[null,"The behaviour of pupils",{"$nulls":6},1016,387,38.090551181102363,494,48.622047244094489,124,12.204724409448819,11,1.0826771653543308]
[null,"The overall welfare, health and safety of pupils",{"$nulls":6},1016,219,21.555118110236222,501,49.311023622047244,200,19.685039370078741,96,9.4488188976377945]
[]
{"$rows_left_out":5}
{"sheet":"Chart 1","index":10,"n_rows":38,"n_cols":6,"rows_kept":38,"cut":false,"hidden":false,"merged":[[3,1,4,1],[3,2,3,5],[15,1,16,1],[15,2,15,5]]}
[]
[null,"Chart 1: Overall quality of education for non-association independent schools inspected between 1 September 2008 and 31 August 2012 (final) 1 2 3 4"]
[]
[null,"Number of schools","Overall quality of education outcome (numbers)"]
[null,null,"Outstanding","Good","Satisfactory","Inadequate"]
[null,"1 September 2011 - 31 August 2012 (361)",48,228,74,11]
[null,"1 September 2010 - 31 August 2011 (314)",31,178,92,13]
[null,"1 September 2009 - 31 August 2010 (319) 1",32,178,94,14]
[null,"1 September 2008 - 31 August 2009 (318)",43,208,54,13]
[{"$nulls":5},"Source: Ofsted inspections"]
[null,null,"Outstanding","Good","Satisfactory","Inadequate"]
[]
[]
[]
[]
{"$rows_left_out":18}
{"sheet":"Chart 2","index":11,"n_rows":35,"n_cols":7,"rows_kept":35,"cut":false,"hidden":false,"merged":[[3,1,4,1],[3,2,3,6],[9,5,9,6],[16,1,17,1],[16,2,16,6]]}
[]
[null,"Chart 2: Overall performance on compliance with regulations by non-association independent schools inspected between 1 September 2008 and 31 August 2012 (final) 1 2 3 4"]
[]
[null,"Number of schools","Number of regulations met by schools"]
[null,null,1,"90-99%","70-89%","50-69%","< 50%"]
[null,"1 September 2011 - 31 August 2012 (361)",217,118,25,1,0]
[null,"1 September 2010 - 31 August 2011 (314)",140,139,33,0,2]
[null,"1 September 2009 - 31 August 2010 (319)",115,159,36,9,0]
[null,"1 September 2008 - 31 August 2009 (318)",126,160,28,4,0]
[{"$nulls":5},"Source: Ofsted inspections"]
[null,null,"Outstanding","Good","Satisfactory","Inadequate","Total"]
[]
[]
[]
[]
{"$rows_left_out":12}