{"text_format":"2","workbook":"xlsx","n_sheets":25,"sheets":["Cover","Contents","Dates1","DataPack","Table 1","Table 2","Table 2a","Table 2b","Table 2c","Table 2d","Table 2e","Table 2f","Table 2g","Table 2h","Table 2i","Table 2j","Table 2k","Table 3","Chart 1","Chart 2","Chart 3","Chart 3a","Chart 3b","Chart 4","Chart 5"],"not_rendered":{"charts":16,"images":1,"macros":0,"external_links":3,"defined_names":21,"comments":0,"pivot_tables":0},"unopened":[],"bounds":{"document_bytes":16777216,"sheet_cells":100000,"run_cost":"one","rows_first":2000,"rows_last":500,"rows_between":2000,"halvings":0,"cell_chars":16384,"cell_head_chars":4096},"cells_cut":0,"cells_raw":0,"read":"whole","date_system":"1900"}

{"sheet":"Cover","index":0,"n_rows":33,"n_cols":3,"rows_kept":33,"cut":false,"hidden":false,"merged":[[12,2,15,2],[12,1,15,1],[5,1,5,2],[27,1,27,2]]}
[]
[]
[]
[]
[]
[null,"Official Statistics Release"]
{"$rows_left_out":28}
{"sheet":"Contents","index":1,"n_rows":48,"n_cols":2,"rows_kept":48,"cut":false,"hidden":false,"merged":[[33,1,33,6],[34,1,34,7],[21,1,21,15],[21,16,21,21],[23,1,23,15],[31,16,31,21],[31,1,31,15],[5,1,5,15],[9,1,9,15],[9,16,9,21],[11,1,11,15],[7,1,7,15],[13,1,13,15],[15,1,15,15],[37,1,37,16],[15,16,15,21],[37,17,37,21],[23,16,23,20],[27,1,27,15],[27,16,27,20],[29,1,29,15],[29,16,29,21],[35,1,35,16]]}
[]
[null,"Contents"]
[]
[null,"Tables"]
[]
[null,"Table 1: Number of learning and skills providers inspected between 1 September 2011 and 31 August 2012, by provider and inspection type (final)"]
{"$rows_left_out":43}
{"sheet":"Dates1","index":2,"n_rows":294,"n_cols":3,"rows_kept":294,"cut":false,"hidden":true,"merged":[]}
[]
[]
[null,"1 September 2011 and 31 August 2012"]
[null,"January 2011"]
[null,"February 2011"]
[null,"March 2011"]
{"$rows_left_out":271}
{"sheet":"DataPack","index":3,"n_rows":452,"n_cols":37,"rows_kept":452,"cut":false,"hidden":true,"merged":[]}
["Table1","Quarter",{"$nulls":8},"Month1",{"$nulls":8},"Month2",{"$nulls":8},"Month3"]
[null,"All L&S","All colleges","HEI","DaDa","ILP","ACL","Next Step","Prison","Probation","All L&S","All colleges","HEI","DaDa","ILP","ACL","Next Step","Prison","Probation","All L&S","All colleges","HEI","DaDa","ILP","ACL","Next Step","Prison","Probation","All L&S","All colleges","HEI","DaDa","ILP","ACL","Next Step","Prison","Probation"]
["Full inspections",300,68,7,16,122,62,2,17,6,0,0,0,0,0,0,0,0,0,0,0,0,0,0,0,0,0,0,0,0,0,0,0,0,0,0,0]
["Re-inspections",9,2,0,0,6,1,0,0,0,0,0,0,0,0,0,0,0,0,0,0,0,0,0,0,0,0,0,0,0,0,0,0,0,0,0,0]
["Focused monitoring visits",123,41,0,0,55,22,5,0,0,0,0,0,0,0,0,0,0,0,0,0,0,0,0,0,0,0,0,0,0,0,0,0,0,0,0,0]
["Re-inspection monitoring visits",35,20,0,0,11,4,0,0,0,0,0,0,0,0,0,0,0,0,0,0,0,0,0,0,0,0,0,0,0,0,0,0,0,0,0,0]
{"$rows_left_out":447}
{"sheet":"Table 1","index":4,"n_rows":17,"n_cols":28,"rows_kept":17,"cut":false,"hidden":false,"merged":[[11,3,11,5],[11,6,11,8],[5,9,5,11],[6,9,6,11],[7,9,7,11],[8,9,8,11],[9,9,9,11],[10,9,10,11],[11,15,11,17],[11,18,11,20],[11,12,11,14],[11,9,11,11],[7,15,7,17],[8,15,8,17],[8,18,8,20],[7,12,7,14],[8,12,8,14],[9,12,9,14],[5,6,5,8],[5,3,5,5],[7,3,7,5],[6,3,6,5],[7,6,7,8],[6,6,6,8],[5,15,5,17],[5,12,5,14],[5,18,5,20],[9,15,9,17],[10,6,10,8],[10,15,10,17],[10,18,10,20],[9,18,9,20],[6,18,6,20],[7,18,7,20],[6,15,6,17],[10,3,10,5],[9,3,9,5],[8,3,8,5],[9,6,9,8],[8,6,8,8],[6,12,6,14],[10,12,10,14],[8,24,8,26],[8,27,8,29],[10,24,10,26],[10,27,10,29],[9,24,9,26],[9,27,9,29],[12,27,12,29],[9,21,9,23],[10,21,10,23],[11,21,11,23],[11,24,11,26],[11,27,11,29],[5,21,5,23],[6,21,6,23],[7,21,7,23],[8,21,8,23],[5,24,5,26],[5,27,5,29],[6,24,6,26],[6,27,6,29],[7,24,7,26],[7,27,7,29]]}
[]
[null,"Table 1: Number of learning and skills providers inspected between 1 September 2011 and 31 August 2012, by provider and inspection type (final)"]
[]
[]
[]
[null,"Inspection activity",null,"All learning and skills",null,null,"All colleges1",null,null,"Dance and drama colleges2",null,null,"Further education in higher education institutions3",null,null,"Independent learning provider4",null,null,"Adult and community learning",null,null,"Next Step",null,null,"Prison and young offender institutions",null,null,"Probation"]
{"$rows_left_out":12}
{"sheet":"Table 2","index":5,"n_rows":35,"n_cols":17,"rows_kept":35,"cut":false,"hidden":false,"merged":[[21,1,21,6],[22,1,22,6],[23,1,23,6],[24,1,24,6],[29,1,29,6],[30,12,30,16],[25,1,25,6],[26,1,26,6],[27,1,27,6],[28,1,28,6],[15,1,15,6],[16,1,16,6],[17,1,17,6],[18,1,18,6],[19,1,19,6],[20,1,20,6],[9,1,9,6],[10,1,10,6],[11,1,11,6],[12,1,12,6],[13,1,13,6],[14,1,14,6],[4,13,4,14],[4,15,4,16],[7,1,7,6],[8,1,8,6],[4,8,5,8],[4,9,4,10],[4,11,4,12]]}
[]
[null,"Table 2: Inspection outcomes of learning and skills providers inspected between 1 September 2011 and 31 August 2012 (final)¹ ² ³"]
[]
[]
[{"$nulls":8},"Total number inspected","Outstanding",null,"Good",null,"Satisfactory",null,"Inadequate"]
[{"$nulls":9},"Number","%","Number","%","Number","%","Number","%"]
{"$rows_left_out":30}
{"sheet":"Table 2a","index":6,"n_rows":35,"n_cols":17,"rows_kept":35,"cut":false,"hidden":false,"merged":[[20,1,20,6],[21,1,21,6],[22,1,22,6],[23,1,23,6],[28,1,28,6],[29,1,29,6],[24,1,24,6],[25,1,25,6],[26,1,26,6],[27,1,27,6],[12,1,12,6],[13,1,13,6],[14,1,14,6],[4,13,4,14],[4,15,4,16],[4,9,4,10],[4,11,4,12],[7,1,7,6],[4,8,5,8],[30,12,30,16],[15,1,15,6],[8,1,8,6],[9,1,9,6],[10,1,10,6],[11,1,11,6],[16,1,16,6],[17,1,17,6],[18,1,18,6],[19,1,19,6]]}
[]
[null,"Table 2a: Inspection outcomes of colleges inspected between 1 September 2011 and 31 August 2012 (final)¹ ² ³"]
[]
[]
[{"$nulls":8},"Total number inspected","Outstanding",null,"Good",null,"Satisfactory",null,"Inadequate"]
[{"$nulls":8},"Number","Number","%","Number","%","Number","%","Number","%"]
{"$rows_left_out":30}
{"sheet":"Table 2b","index":7,"n_rows":35,"n_cols":17,"rows_kept":35,"cut":false,"hidden":false,"merged":[[30,12,30,16],[4,9,4,10],[4,11,4,12],[4,13,4,14],[4,15,4,16],[27,1,27,6],[26,1,26,6],[23,1,23,6],[25,1,25,6],[24,1,24,6],[4,8,5,8],[29,1,29,6],[28,1,28,6],[15,1,15,6],[20,1,20,6],[19,1,19,6],[18,1,18,6],[17,1,17,6],[22,1,22,6],[21,1,21,6],[8,1,8,6],[9,1,9,6],[10,1,10,6],[7,1,7,6],[16,1,16,6],[11,1,11,6],[12,1,12,6],[13,1,13,6],[14,1,14,6]]}
[]
[null,"Table 2b: Inspection outcomes of general further education colleges/tertiary colleges inspected between 1 September 2011 and 31 August 2012 (final)¹ ² ³"]
[]
[]
[{"$nulls":8},"Total number inspected","Outstanding",null,"Good",null,"Satisfactory",null,"Inadequate"]
[{"$nulls":8},"Number","Number","%","Number","%","Number","%","Number","%"]
{"$rows_left_out":30}
{"sheet":"Table 2c","index":8,"n_rows":34,"n_cols":17,"rows_kept":34,"cut":false,"hidden":false,"merged":[[16,1,16,6],[4,8,5,8],[11,1,11,6],[12,1,12,6],[13,1,13,6],[8,1,8,6],[9,1,9,6],[10,1,10,6],[7,1,7,6],[26,1,26,6],[14,1,14,6],[15,1,15,6],[23,1,23,6],[22,1,22,6],[21,1,21,6],[20,1,20,6],[19,1,19,6],[18,1,18,6],[17,1,17,6],[30,12,30,16],[4,9,4,10],[4,11,4,12],[4,13,4,14],[4,15,4,16],[25,1,25,6],[24,1,24,6],[29,1,29,6],[28,1,28,6],[27,1,27,6]]}
[]
[null,"Table 2c: Inspection outcomes of sixth form colleges inspected between 1 September 2011 and 31 August 2012 (final)¹ ²"]
[]
[]
[{"$nulls":8},"Total number inspected","Outstanding",null,"Good",null,"Satisfactory",null,"Inadequate"]
[{"$nulls":8},"Number","Number","%","Number","%","Number","%","Number","%"]
{"$rows_left_out":29}
{"sheet":"Table 2d","index":9,"n_rows":33,"n_cols":17,"rows_kept":33,"cut":false,"hidden":false,"merged":[[26,1,26,6],[22,1,22,6],[25,1,25,6],[24,1,24,6],[29,1,29,6],[28,1,28,6],[30,12,30,16],[4,9,4,10],[4,11,4,12],[4,13,4,14],[4,15,4,16],[27,1,27,6],[20,1,20,6],[19,1,19,6],[18,1,18,6],[17,1,17,6],[21,1,21,6],[23,1,23,6],[16,1,16,6],[11,1,11,6],[12,1,12,6],[13,1,13,6],[14,1,14,6],[15,1,15,6],[4,8,5,8],[4,2,4,6],[8,1,8,6],[9,1,9,6],[10,1,10,6],[7,1,7,6]]}
[]
[null,{"$f":"\"Table 2d: Inspection outcomes of independent specialist colleges inspected \" & IF('Table 2d'!C5=Dates1!$B$3, \"between \" & Dates1!$B$3, IF('Table 2d'!C5 = Dates1!B4, \"in \" & Dates1!B4, IF('Table 2d'!C5=Dates1!B5, \"in \" & Dates1!B5, IF('Table 2d'!C5=Dates1!B6, \"in \" & Dates1!B6, IF('Table 2d'!C5=Dates1!B7, \"in \" & Dates1!B7)))))  & \" (final)\"&CHAR(185)","v":"Table 2d: Inspection outcomes of independent specialist colleges inspected between 1 September 2011 and 31 August 2012 (final)¹"}]
[]
[]
[null,"Select period:","1 September 2011 and 31 August 2012",{"$nulls":5},"Total number inspected","Outstanding",null,"Good",null,"Satisfactory",null,"Inadequate"]
[{"$nulls":8},"Number","Number","%","Number","%","Number","%","Number","%"]
{"$rows_left_out":28}
{"sheet":"Table 2e","index":10,"n_rows":33,"n_cols":17,"rows_kept":33,"cut":false,"hidden":false,"merged":[[26,1,26,6],[27,1,27,6],[28,1,28,6],[29,1,29,6],[30,12,30,16],[20,1,20,6],[21,1,21,6],[22,1,22,6],[23,1,23,6],[24,1,24,6],[25,1,25,6],[14,1,14,6],[15,1,15,6],[16,1,16,6],[17,1,17,6],[18,1,18,6],[19,1,19,6],[8,1,8,6],[9,1,9,6],[10,1,10,6],[11,1,11,6],[12,1,12,6],[13,1,13,6],[4,8,5,8],[4,9,4,10],[4,11,4,12],[4,13,4,14],[4,15,4,16],[7,1,7,6]]}
[]
[null,"Table 2e: Inspection outcomes of higher education institutes inspected between 1 September 2011 and 31 August 2012 (final)¹"]
[null,"Inspection judgements relate to the further education provision only not providers as a whole"]
[]
[{"$nulls":8},"Total number inspected","Outstanding",null,"Good",null,"Satisfactory",null,"Inadequate"]
[{"$nulls":8},"Number","Number","%","Number","%","Number","%","Number","%"]
{"$rows_left_out":28}
{"sheet":"Table 2f","index":11,"n_rows":33,"n_cols":17,"rows_kept":33,"cut":false,"hidden":false,"merged":[[26,1,26,6],[27,1,27,6],[28,1,28,6],[29,1,29,6],[30,12,30,16],[20,1,20,6],[21,1,21,6],[22,1,22,6],[23,1,23,6],[24,1,24,6],[25,1,25,6],[14,1,14,6],[15,1,15,6],[16,1,16,6],[17,1,17,6],[18,1,18,6],[19,1,19,6],[8,1,8,6],[9,1,9,6],[10,1,10,6],[11,1,11,6],[12,1,12,6],[13,1,13,6],[4,8,5,8],[4,9,4,10],[4,11,4,12],[4,13,4,14],[4,15,4,16],[7,1,7,6]]}
[]
[null,"Table 2f: Inspection outcomes of dance and drama colleges inspected between 1 September 2011 and 31 August 2012 (final)¹"]
[null,"Inspection judgements relate to the provision of the Dance and Drama Awards scheme only and not providers as a whole"]
[]
[{"$nulls":8},"Total number inspected","Outstanding",null,"Good",null,"Satisfactory",null,"Inadequate"]
[{"$nulls":8},"Number","Number","%","Number","%","Number","%","Number","%"]
{"$rows_left_out":28}
{"sheet":"Table 2g","index":12,"n_rows":35,"n_cols":17,"rows_kept":35,"cut":false,"hidden":false,"merged":[[26,1,26,6],[22,1,22,6],[25,1,25,6],[24,1,24,6],[29,1,29,6],[28,1,28,6],[30,12,30,16],[4,9,4,10],[4,11,4,12],[4,13,4,14],[4,15,4,16],[27,1,27,6],[20,1,20,6],[19,1,19,6],[18,1,18,6],[17,1,17,6],[23,1,23,6],[16,1,16,6],[11,1,11,6],[12,1,12,6],[13,1,13,6],[14,1,14,6],[15,1,15,6],[4,8,5,8],[8,1,8,6],[9,1,9,6],[10,1,10,6],[7,1,7,6],[21,1,21,6]]}
[]
[null,"Table 2g: Inspection outcomes of independent learning providers inspected between 1 September 2011 and 31 August 2012 (final)¹ ² ³"]
[]
[]
[{"$nulls":8},"Total number inspected","Outstanding",null,"Good",null,"Satisfactory",null,"Inadequate"]
[{"$nulls":8},"Number","Number","%","Number","%","Number","%","Number","%"]
{"$rows_left_out":30}
{"sheet":"Table 2h","index":13,"n_rows":34,"n_cols":17,"rows_kept":34,"cut":false,"hidden":false,"merged":[[11,1,11,6],[12,1,12,6],[13,1,13,6],[8,1,8,6],[9,1,9,6],[10,1,10,6],[7,1,7,6],[14,1,14,6],[15,1,15,6],[23,1,23,6],[22,1,22,6],[21,1,21,6],[20,1,20,6],[19,1,19,6],[18,1,18,6],[17,1,17,6],[16,1,16,6],[25,1,25,6],[24,1,24,6],[29,1,29,6],[28,1,28,6],[27,1,27,6],[26,1,26,6],[4,8,5,8],[30,12,30,16],[4,9,4,10],[4,11,4,12],[4,13,4,14],[4,15,4,16]]}
[]
[null,"Table 2h: Inspection outcomes of adult and community learning providers inspected between 1 September 2011 and 31 August 2012 (final)¹ ²"]
[]
[]
[{"$nulls":8},"Total number inspected","Outstanding",null,"Good",null,"Satisfactory",null,"Inadequate"]
[{"$nulls":8},"Number","Number","%","Number","%","Number","%","Number","%"]
{"$rows_left_out":29}
{"sheet":"Table 2i","index":14,"n_rows":33,"n_cols":17,"rows_kept":33,"cut":false,"hidden":false,"merged":[[26,1,26,6],[27,1,27,6],[28,1,28,6],[29,1,29,6],[30,12,30,16],[20,1,20,6],[21,1,21,6],[22,1,22,6],[23,1,23,6],[24,1,24,6],[25,1,25,6],[14,1,14,6],[15,1,15,6],[16,1,16,6],[17,1,17,6],[18,1,18,6],[19,1,19,6],[8,1,8,6],[9,1,9,6],[10,1,10,6],[11,1,11,6],[12,1,12,6],[13,1,13,6],[4,8,5,8],[4,9,4,10],[4,11,4,12],[4,13,4,14],[4,15,4,16],[7,1,7,6]]}
[]
[null,"Table 2i: Inspection outcomes of Next Step providers inspected between 1 September 2011 and 31 August 2012 (final)¹"]
[]
[]
[{"$nulls":8},"Total number inspected","Outstanding",null,"Good",null,"Satisfactory",null,"Inadequate"]
[{"$nulls":8},"Number","Number","%","Number","%","Number","%","Number","%"]
{"$rows_left_out":28}
{"sheet":"Table 2j","index":15,"n_rows":33,"n_cols":17,"rows_kept":33,"cut":false,"hidden":false,"merged":[[11,1,11,6],[12,1,12,6],[13,1,13,6],[8,1,8,6],[9,1,9,6],[10,1,10,6],[7,1,7,6],[14,1,14,6],[15,1,15,6],[23,1,23,6],[22,1,22,6],[21,1,21,6],[20,1,20,6],[19,1,19,6],[18,1,18,6],[17,1,17,6],[16,1,16,6],[25,1,25,6],[24,1,24,6],[29,1,29,6],[28,1,28,6],[27,1,27,6],[26,1,26,6],[4,8,5,8],[30,12,30,16],[4,9,4,10],[4,11,4,12],[4,13,4,14],[4,15,4,16]]}
[]
[null,"Table 2j: Inspection outcomes of prison and young offender institutions inspected between 1 September 2011 and 31 August 2012 (final)¹"]
[]
[]
[{"$nulls":8},"Total number inspected","Outstanding",null,"Good",null,"Satisfactory",null,"Inadequate"]
[{"$nulls":8},"Number","Number","%","Number","%","Number","%","Number","%"]
{"$rows_left_out":28}
{"sheet":"Table 2k","index":16,"n_rows":33,"n_cols":17,"rows_kept":33,"cut":false,"hidden":false,"merged":[[22,1,22,6],[23,1,23,6],[24,1,24,6],[25,1,25,6],[30,12,30,16],[26,1,26,6],[27,1,27,6],[28,1,28,6],[29,1,29,6],[16,1,16,6],[17,1,17,6],[18,1,18,6],[19,1,19,6],[20,1,20,6],[21,1,21,6],[10,1,10,6],[11,1,11,6],[12,1,12,6],[13,1,13,6],[14,1,14,6],[15,1,15,6],[4,15,4,16],[7,1,7,6],[8,1,8,6],[9,1,9,6],[4,9,4,10],[4,11,4,12],[4,13,4,14],[4,8,5,8]]}
[]
[null,"Table 2k: Inspection outcomes of probation trusts inspected between 1 September 2011 and 31 August 2012 (final)¹"]
[]
[]
[{"$nulls":8},"Total number inspected","Outstanding",null,"Good",null,"Satisfactory",null,"Inadequate"]
[{"$nulls":8},"Number","Number","%","Number","%","Number","%","Number","%"]
{"$rows_left_out":28}
{"sheet":"Table 3","index":17,"n_rows":38,"n_cols":7,"rows_kept":38,"cut":false,"hidden":false,"merged":[[47,2,47,4],[48,2,48,4],[5,1,6,1],[5,5,6,5],[39,2,39,4],[40,2,40,4],[5,2,6,4],[37,2,37,4],[37,5,37,6],[5,6,6,6],[41,2,41,4],[42,2,42,4],[43,2,43,4],[44,2,44,4],[45,2,45,4],[46,2,46,4],[49,2,49,4],[50,2,50,4],[63,2,63,4],[62,2,62,4],[51,2,51,4],[52,2,52,4],[64,2,64,4],[53,2,53,4],[54,2,54,4],[55,2,55,4],[56,2,56,4],[57,2,57,4],[58,2,58,4],[59,2,59,4],[60,2,60,4],[61,2,61,4],[75,2,75,4],[76,2,76,4],[65,2,65,4],[66,2,66,4],[67,2,67,4],[68,2,68,4],[69,2,69,4],[70,2,70,4],[71,2,71,4],[72,2,72,4],[73,2,73,4],[74,2,74,4],[87,2,87,4],[88,2,88,4],[77,2,77,4],[78,2,78,4],[79,2,79,4],[80,2,80,4],[81,2,81,4],[82,2,82,4],[95,2,95,4],[96,2,96,4],[83,2,83,4],[84,2,84,4],[85,2,85,4],[86,2,86,4],[89,2,89,4],[90,2,90,4],[91,2,91,4],[92,2,92,4],[93,2,93,4],[94,2,94,4],[111,2,111,4],[112,2,112,4],[101,2,101,4],[102,2,102,4],[103,2,103,4],[104,2,104,4],[105,2,105,4],[106,2,106,4],[107,2,107,4],[108,2,108,4],[109,2,109,4],[110,2,110,4],[97,2,97,4],[98,2,98,4],[99,2,99,4],[100,2,100,4],[123,2,123,4],[124,2,124,4],[113,2,113,4],[114,2,114,4],[115,2,115,4],[116,2,116,4],[117,2,117,4],[118,2,118,4],[119,2,119,4],[120,2,120,4],[121,2,121,4],[122,2,122,4],[135,2,135,4],[136,2,136,4],[125,2,125,4],[126,2,126,4],[127,2,127,4],[128,2,128,4],[129,2,129,4],[130,2,130,4],[143,2,143,4],[144,2,144,4],[131,2,131,4],[132,2,132,4],[133,2,133,4],[134,2,134,4],[137,2,137,4],[138,2,138,4],[139,2,139,4],[140,2,140,4],[141,2,141,4],[142,2,142,4],[159,2,159,4],[160,2,160,4],[149,2,149,4],[150,2,150,4],[151,2,151,4],[152,2,152,4],[153,2,153,4],[154,2,154,4],[155,2,155,4],[156,2,156,4],[157,2,157,4],[158,2,158,4],[145,2,145,4],[146,2,146,4],[147,2,147,4],[148,2,148,4],[171,2,171,4],[172,2,172,4],[161,2,161,4],[162,2,162,4],[163,2,163,4],[164,2,164,4],[165,2,165,4],[166,2,166,4],[167,2,167,4],[168,2,168,4],[169,2,169,4],[170,2,170,4],[183,2,183,4],[184,2,184,4],[173,2,173,4],[174,2,174,4],[175,2,175,4],[176,2,176,4],[177,2,177,4],[178,2,178,4],[191,2,191,4],[192,2,192,4],[179,2,179,4],[180,2,180,4],[181,2,181,4],[182,2,182,4],[185,2,185,4],[186,2,186,4],[187,2,187,4],[188,2,188,4],[189,2,189,4],[190,2,190,4],[207,2,207,4],[208,2,208,4],[197,2,197,4],[198,2,198,4],[199,2,199,4],[200,2,200,4],[201,2,201,4],[202,2,202,4],[203,2,203,4],[204,2,204,4],[205,2,205,4],[206,2,206,4],[193,2,193,4],[194,2,194,4],[195,2,195,4],[196,2,196,4],[219,2,219,4],[220,2,220,4],[209,2,209,4],[210,2,210,4],[211,2,211,4],[212,2,212,4],[213,2,213,4],[214,2,214,4],[215,2,215,4],[216,2,216,4],[217,2,217,4],[218,2,218,4],[231,2,231,4],[232,2,232,4],[221,2,221,4],[222,2,222,4],[223,2,223,4],[224,2,224,4],[225,2,225,4],[226,2,226,4],[239,2,239,4],[240,2,240,4],[227,2,227,4],[228,2,228,4],[229,2,229,4],[230,2,230,4],[233,2,233,4],[234,2,234,4],[235,2,235,4],[236,2,236,4],[237,2,237,4],[238,2,238,4],[255,2,255,4],[256,2,256,4],[245,2,245,4],[246,2,246,4],[247,2,247,4],[248,2,248,4],[249,2,249,4],[250,2,250,4],[251,2,251,4],[252,2,252,4],[253,2,253,4],[254,2,254,4],[241,2,241,4],[242,2,242,4],[243,2,243,4],[244,2,244,4],[267,2,267,4],[268,2,268,4],[257,2,257,4],[258,2,258,4],[259,2,259,4],[260,2,260,4],[261,2,261,4],[262,2,262,4],[263,2,263,4],[264,2,264,4],[265,2,265,4],[266,2,266,4],[279,2,279,4],[280,2,280,4],[269,2,269,4],[270,2,270,4],[271,2,271,4],[272,2,272,4],[273,2,273,4],[274,2,274,4],[287,2,287,4],[288,2,288,4],[275,2,275,4],[276,2,276,4],[277,2,277,4],[278,2,278,4],[281,2,281,4],[282,2,282,4],[283,2,283,4],[284,2,284,4],[285,2,285,4],[286,2,286,4],[303,2,303,4],[304,2,304,4],[293,2,293,4],[294,2,294,4],[295,2,295,4],[296,2,296,4],[297,2,297,4],[298,2,298,4],[299,2,299,4],[300,2,300,4],[301,2,301,4],[302,2,302,4],[289,2,289,4],[290,2,290,4],[291,2,291,4],[292,2,292,4],[315,2,315,4],[316,2,316,4],[305,2,305,4],[306,2,306,4],[307,2,307,4],[308,2,308,4],[309,2,309,4],[310,2,310,4],[311,2,311,4],[312,2,312,4],[313,2,313,4],[314,2,314,4],[327,2,327,4],[328,2,328,4],[317,2,317,4],[318,2,318,4],[319,2,319,4],[320,2,320,4],[321,2,321,4],[322,2,322,4],[335,2,335,4],[336,2,336,4],[323,2,323,4],[324,2,324,4],[325,2,325,4],[326,2,326,4],[329,2,329,4],[330,2,330,4],[331,2,331,4],[332,2,332,4],[333,2,333,4],[334,2,334,4],[351,2,351,4],[352,2,352,4],[341,2,341,4],[342,2,342,4],[343,2,343,4],[344,2,344,4],[345,2,345,4],[346,2,346,4],[347,2,347,4],[348,2,348,4],[349,2,349,4],[350,2,350,4],[337,2,337,4],[338,2,338,4],[339,2,339,4],[340,2,340,4],[363,2,363,4],[364,2,364,4],[353,2,353,4],[354,2,354,4],[355,2,355,4],[356,2,356,4],[357,2,357,4],[358,2,358,4],[359,2,359,4],[360,2,360,4],[361,2,361,4],[362,2,362,4],[375,2,375,4],[376,2,376,4],[365,2,365,4],[366,2,366,4],[367,2,367,4],[368,2,368,4],[369,2,369,4],[370,2,370,4],[383,2,383,4],[384,2,384,4],[371,2,371,4],[372,2,372,4],[373,2,373,4],[374,2,374,4],[377,2,377,4],[378,2,378,4],[379,2,379,4],[380,2,380,4],[381,2,381,4],[382,2,382,4],[399,2,399,4],[400,2,400,4],[389,2,389,4],[390,2,390,4],[391,2,391,4],[392,2,392,4],[393,2,393,4],[394,2,394,4],[395,2,395,4],[396,2,396,4],[397,2,397,4],[398,2,398,4],[385,2,385,4],[386,2,386,4],[387,2,387,4],[388,2,388,4],[411,2,411,4],[412,2,412,4],[401,2,401,4],[402,2,402,4],[403,2,403,4],[404,2,404,4],[405,2,405,4],[406,2,406,4],[407,2,407,4],[408,2,408,4],[409,2,409,4],[410,2,410,4],[423,2,423,4],[424,2,424,4],[413,2,413,4],[414,2,414,4],[415,2,415,4],[416,2,416,4],[417,2,417,4],[418,2,418,4],[431,2,431,4],[432,2,432,4],[419,2,419,4],[420,2,420,4],[421,2,421,4],[422,2,422,4],[425,2,425,4],[426,2,426,4],[427,2,427,4],[428,2,428,4],[429,2,429,4],[430,2,430,4],[447,2,447,4],[448,2,448,4],[437,2,437,4],[438,2,438,4],[439,2,439,4],[440,2,440,4],[441,2,441,4],[442,2,442,4],[443,2,443,4],[444,2,444,4],[445,2,445,4],[446,2,446,4],[433,2,433,4],[434,2,434,4],[435,2,435,4],[436,2,436,4],[459,2,459,4],[460,2,460,4],[449,2,449,4],[450,2,450,4],[451,2,451,4],[452,2,452,4],[453,2,453,4],[454,2,454,4],[455,2,455,4],[456,2,456,4],[457,2,457,4],[458,2,458,4],[471,2,471,4],[472,2,472,4],[461,2,461,4],[462,2,462,4],[463,2,463,4],[464,2,464,4],[465,2,465,4],[466,2,466,4],[479,2,479,4],[480,2,480,4],[467,2,467,4],[468,2,468,4],[469,2,469,4],[470,2,470,4],[473,2,473,4],[474,2,474,4],[475,2,475,4],[476,2,476,4],[477,2,477,4],[478,2,478,4],[495,2,495,4],[496,2,496,4],[485,2,485,4],[486,2,486,4],[487,2,487,4],[488,2,488,4],[489,2,489,4],[490,2,490,4],[491,2,491,4],[492,2,492,4],[493,2,493,4],[494,2,494,4],[481,2,481,4],[482,2,482,4],[483,2,483,4],[484,2,484,4],[507,2,507,4],[508,2,508,4],[497,2,497,4],[498,2,498,4],[499,2,499,4],[500,2,500,4],[501,2,501,4],[502,2,502,4],[503,2,503,4],[504,2,504,4],[505,2,505,4],[506,2,506,4],[519,2,519,4],[520,2,520,4],[509,2,509,4],[510,2,510,4],[511,2,511,4],[512,2,512,4],[513,2,513,4],[514,2,514,4],[527,2,527,4],[528,2,528,4],[515,2,515,4],[516,2,516,4],[517,2,517,4],[518,2,518,4],[521,2,521,4],[522,2,522,4],[523,2,523,4],[524,2,524,4],[525,2,525,4],[526,2,526,4],[543,2,543,4],[544,2,544,4],[533,2,533,4],[534,2,534,4],[535,2,535,4],[536,2,536,4],[537,2,537,4],[538,2,538,4],[539,2,539,4],[540,2,540,4],[541,2,541,4],[542,2,542,4],[529,2,529,4],[530,2,530,4],[531,2,531,4],[532,2,532,4],[570,2,570,4],[571,2,571,4],[545,2,545,4],[546,2,546,4],[547,2,547,4],[548,2,548,4],[549,2,549,4],[550,2,550,4],[551,2,551,4],[552,2,552,4],[553,2,553,4],[554,2,554,4],[561,2,561,4],[562,2,562,4],[555,2,555,4],[556,2,556,4],[557,2,557,4],[558,2,558,4],[559,2,559,4],[560,2,560,4],[574,2,574,4],[563,2,563,4],[564,2,564,4],[565,2,565,4],[566,2,566,4],[567,2,567,4],[568,2,568,4],[569,2,569,4],[572,2,572,4],[573,2,573,4]]}
[]
[null,"Table 3: Learning and skills providers judged inadequate between 1 September 2011 and 31 August 2012 (final)"]
[]
[]
[]
[null,"URN","Provider name",null,null,"Type of provider","Date of inspection"]
{"$rows_left_out":33}
{"sheet":"Chart 1","index":18,"n_rows":46,"n_cols":14,"rows_kept":46,"cut":false,"hidden":false,"merged":[[3,2,3,4],[6,11,6,15],[6,1,7,1],[6,2,7,2],[6,3,6,6],[43,1,43,9]]}
[]
[null,{"$f":"\"Chart 1: Overall effectiveness of learning and skills providers inspected \" & IF('Chart 1'!$C$4=Dates1!$B$3, \"between \" & Dates1!$B$3, IF('Chart 1'!$C$4 = Dates1!B3, \"in \"&Dates1!B3, IF('Chart 1'!$C$4=Dates1!B4,\"in \"& Dates1!B4, IF('Chart 1'!$C$4=Dates1!B5,\"in \"& Dates1!B5, IF('Chart 1'!$C$4=Dates1!B6, \"in \" & Dates1!B6, IF('Chart 1'!$C$4=Dates1!B7, \"in \" & Dates1!B7)))))) & \" (final)\"&CHAR(185)&\" \"&CHAR(178)","v":"Chart 1: Overall effectiveness of learning and skills providers inspected between 1 September 2011 and 31 August 2012 (final)¹ ²"}]
[]
[null,"Select period:","1 September 2011 and 31 August 2012"]
[]
[null,"Number of providers"]
{"$rows_left_out":20}
{"sheet":"Chart 2","index":19,"n_rows":38,"n_cols":15,"rows_kept":38,"cut":false,"hidden":false,"merged":[[6,11,6,15],[3,2,3,4],[14,5,14,6],[6,1,7,1],[6,2,7,2],[6,3,6,6]]}
[]
[null,{"$f":"\"Chart 2: Key inspection judgements of learning and skills providers inspected \" & IF('Chart 2'!$C$4=Dates1!$B$3, \"between \" & Dates1!$B$3, IF('Chart 2'!$C$4 = Dates1!$B$4, \"in \"&Dates1!$B$4, IF('Chart 2'!$C$4=Dates1!$B$5,\"in \"& Dates1!$B$5, IF('Chart 2'!$C$4=Dates1!$B$6,\"in \"& Dates1!$B$6, IF('Chart 2'!$C$4=Dates1!$B$7, \"in \" &Dates1!$B$7))))) & \" (final)\"&CHAR(185)&\" \"&CHAR(178)&\" \"&CHAR(179)","v":"Chart 2: Key inspection judgements of learning and skills providers inspected between 1 September 2011 and 31 August 2012 (final)¹ ² ³"}]
[]
[null,"Select period:","1 September 2011 and 31 August 2012"]
[]
[]
{"$rows_left_out":14}
{"sheet":"Chart 3","index":20,"n_rows":38,"n_cols":16,"rows_kept":38,"cut":false,"hidden":false,"merged":[[4,2,5,2],[4,3,4,6]]}
[]
[null,"Chart 3: Overall effectiveness of colleges inspected between 1 September 2005 and 31 August 2012, by academic year (final) 1 2"]
[]
[]
[null,null,"Total number inspected","Overall effectiveness"]
[null,null,null,"Outstanding","Good","Satisfactory","Inadequate",{"$nulls":5},"Outstanding","Good","Satisfactory","Inadequate"]
{"$rows_left_out":13}
{"sheet":"Chart 3a","index":21,"n_rows":37,"n_cols":17,"rows_kept":37,"cut":false,"hidden":false,"merged":[[4,2,5,2],[4,3,4,6]]}
[]
[null,"Chart 3a: Overall effectiveness of independent learning providers inspected between 1 September 2007 and 31 August 2012, by academic year (final) 1 2 3"]
[]
[]
[null,null,"Total number inspected","Overall effectiveness"]
[null,"Number of providers",null,"Outstanding","Good","Satisfactory","Inadequate",{"$nulls":6},"Outstanding","Good","Satisfactory","Inadequate"]
{"$rows_left_out":11}
{"sheet":"Chart 3b","index":22,"n_rows":35,"n_cols":15,"rows_kept":35,"cut":false,"hidden":false,"merged":[[4,2,5,2],[4,3,4,6]]}
[]
[null,"Chart 3b: Overall effectiveness of adult and community learning providers inspected between 1 September 2007 and 31 August 2012, by academic year (final) 1 2"]
[]
[]
[null,null,"Total number inspected","Overall effectiveness"]
[null,"Number of providers",null,"Outstanding","Good","Satisfactory","Inadequate",{"$nulls":4},"Outstanding","Good","Satisfactory","Inadequate"]
{"$rows_left_out":10}
{"sheet":"Chart 4","index":23,"n_rows":37,"n_cols":16,"rows_kept":37,"cut":false,"hidden":false,"merged":[[4,2,5,2],[4,3,4,6]]}
[]
[null,"Chart 4: Overall effectiveness of learning and skills providers inspected at 31 August 2012 1 2 "]
[]
[]
[null,null,"Total number inspected","Overall effectiveness"]
[null,"Number of providers",null,"Outstanding","Good","Satisfactory","Inadequate",{"$nulls":5},"Outstanding","Good","Satisfactory","Inadequate"]
{"$rows_left_out":11}
{"sheet":"Chart 5","index":24,"n_rows":34,"n_cols":17,"rows_kept":34,"cut":false,"hidden":false,"merged":[[4,2,5,2],[4,3,4,6],[33,1,34,11]]}
[]
[null,"Chart 5:  Most recent overall effectiveness of learning and skills providers inspected at 31 August 2012 compared to the most recent overall effectiveness at 31 August 2011 "]
[null,"and 31 August 2010 (final) 1 2"]
[]
[null,null,"Total number inspected","Overall effectiveness"]
[null,null,null,"Outstanding","Good","Satisfactory","Inadequate",{"$nulls":6},"Outstanding","Good","Satisfactory","Inadequate"]
{"$rows_left_out":7}