{"text_format":"2","workbook":"xlsx","n_sheets":12,"sheets":["Covers","Contents","Dates1","Datapack","Table 1","Table 2","Table 3","Table 4","Table 5","Table 6","Chart 1","Chart 2"],"not_rendered":{"charts":2,"images":1,"macros":0,"external_links":1,"defined_names":8,"comments":0,"pivot_tables":0},"unopened":[],"bounds":{"document_bytes":16777216,"sheet_cells":100000,"run_cost":"one","rows_first":2000,"rows_last":500,"rows_between":2000,"halvings":0,"cell_chars":16384,"cell_head_chars":4096},"cells_cut":0,"cells_raw":0,"read":"whole","date_system":"1900"}

{"sheet":"Covers","index":0,"n_rows":33,"n_cols":3,"rows_kept":33,"cut":false,"hidden":false,"merged":[[5,1,5,2],[12,1,15,1],[12,2,15,2],[27,1,27,2]]}
[]
[]
[]
[]
[]
[null,"Official Statistics Release"]
[null,"Policy area:","Children's centres inspections and outcomes"]
[null,"Theme:","Education, children’s services and skills"]
[null,"Published on:","27 November 2012"]
[null,"Coverage:","England"]
{"$rows_left_out":24}
{"sheet":"Contents","index":1,"n_rows":24,"n_cols":2,"rows_kept":24,"cut":false,"hidden":false,"merged":[[19,1,19,6],[11,1,11,13],[9,1,9,21],[5,1,5,17],[7,1,7,17],[17,1,17,20],[27,1,27,21],[21,1,21,21],[23,1,23,21],[25,1,25,21],[13,1,13,8]]}
[]
[null,"Contents"]
[]
[null,"National level"]
[]
[null,"Table 1: Number of children's centres inspected between 1 April 2010 and 31 August 2012"]
[]
[null,"Table 2: Inspection outcomes of children's centres inspected between 1 September 2011 and 31 August 2012 "]
[]
[null,"Table 3: Most recent inspection outcomes of children's centres as at 31 August 2012"]
{"$rows_left_out":15}
{"sheet":"Dates1","index":2,"n_rows":11,"n_cols":2,"rows_kept":11,"cut":false,"hidden":true,"merged":[]}
[]
[]
[null,"1 September 2011 and 31 August 2012"]
{"$rows_empty":7}
[null,"1 September 2011 and 31 August 2012"]

{"sheet":"Datapack","index":3,"n_rows":384,"n_cols":12,"rows_kept":384,"cut":false,"hidden":true,"merged":[]}
[]
["Table 2","September 2011 - August 2012"]
["Judgement","Outstanding","Good","Satisfactory","Inadequate","Total"]
["Overall effectiveness",86,378,226,18,708]
["Capacity for sustained improvement",103,369,220,16,708]
["Outcomes for users",82,390,219,17,708]
["Being healthy",77,374,249,8,708]
["Safe and protected",175,416,109,8,708]
["Enjoy and achieve",92,407,204,5,708]
["Engaging in positive behaviour",105,356,231,16,708]
{"$rows_left_out":368}
{"sheet":"Table 1","index":4,"n_rows":14,"n_cols":3,"rows_kept":14,"cut":false,"hidden":false,"merged":[[1,1,1,10]]}
[]
[null,"Table 1: Number of children's centres inspected between 1 April 2010 and 31 August 2012"]
[]
[]
[null,null,"Full inspections"]
[]
[null,"All inspections since April 20101",1457]
[]
[null,"1 September 2011 - 31 August 2012",708]
[]
{"$rows_left_out":5}
{"sheet":"Table 2","index":5,"n_rows":35,"n_cols":21,"rows_kept":35,"cut":false,"hidden":false,"merged":[[1,1,1,20],[3,8,3,13],[5,19,5,20],[5,10,5,11],[5,8,6,8],[5,16,5,17],[3,5,3,6],[5,13,5,14],[9,1,9,6],[10,1,10,6],[26,1,26,6],[28,1,28,6],[23,1,23,6],[21,1,21,6],[18,1,18,6],[24,1,24,6],[31,1,31,6],[27,1,27,6],[11,1,11,6],[22,1,22,6],[30,1,30,6],[17,1,17,6],[20,1,20,6],[25,1,25,6],[29,1,29,6],[35,1,36,20],[13,1,13,6],[15,1,15,6],[14,1,14,6],[8,1,8,6],[19,1,19,6],[32,17,32,20],[12,1,12,6],[16,1,16,6],[34,1,34,20]]}
[]
[null,{"$f":"\"Table 2: Inspection outcomes of children's centres inspected \" & IF('Table 2'!I4=Dates1!$B$3, \"between \" & Dates1!$B$3, IF('Table 2'!I4 = Dates1!B4, \"in \" & Dates1!B4, IF('Table 2'!I4=Dates1!B5, \"in \" & Dates1!B5, IF('Table 2'!I4=Dates1!B6, \"in \" & Dates1!B6))))  & \"\" & CHAR(185)","v":"Table 2: Inspection outcomes of children's centres inspected between 1 September 2011 and 31 August 2012¹"}]
[]
[{"$nulls":8},"1 September 2011 and 31 August 2012"]
[]
[{"$nulls":8},"Total number inspected",null,"Outstanding",null,null,"Good",null,null,"Satisfactory",null,null,"Inadequate"]
[{"$nulls":10},"Number","%",null,"Number","%",null,"Number","%",null,"Number","%"]
[]
[null,"The effectiveness of the children’s centre in meeting the needs of and improving outcomes for families",{"$nulls":6},{"$f":"IF($I4=\"Select a quarter that matches the period from the box, right.\",\"-\",K9+N9+Q9+T9)","v":708},null,{"$f":"IF($I$4=Dates1!$B$3,Datapack!B4,IF($I$4=Dates1!$B$4,Datapack!H4,IF($I$4=Dates1!$B$5,Datapack!N4,IF($I$4=Dates1!$B$6,Datapack!T4))))","v":86},{"$f":"K9/$I9*100","v":12.146892655367232},null,{"$f":"IF($I$4=Dates1!$B$3,Datapack!C4,IF($I$4=Dates1!$B$4,Datapack!I4,IF($I$4=Dates1!$B$5,Datapack!O4,IF($I$4=Dates1!$B$6,Datapack!U4))))","v":378},{"$f":"N9/$I9*100","v":53.389830508474581},null,{"$f":"IF($I$4=Dates1!$B$3,Datapack!D4,IF($I$4=Dates1!$B$4,Datapack!J4,IF($I$4=Dates1!$B$5,Datapack!P4,IF($I$4=Dates1!$B$6,Datapack!V4))))","v":226},{"$f":"Q9/$I9*100","v":31.92090395480226},null,{"$f":"IF($I$4=Dates1!$B$3,Datapack!E4,IF($I$4=Dates1!$B$4,Datapack!K4,IF($I$4=Dates1!$B$5,Datapack!Q4,IF($I$4=Dates1!$B$6,Datapack!W4))))","v":18},{"$f":"T9/$I9*100","v":2.5423728813559325}]
[null,"The centre’s capacity for sustained improvement, including the quality of its leadership and management",{"$nulls":6},{"$f":"IF($I5=\"Select a quarter that matches the period from the box, right.\",\"-\",K10+N10+Q10+T10)","v":708},null,{"$f":"IF($I$4=Dates1!$B$3,Datapack!B5,IF($I$4=Dates1!$B$4,Datapack!H5,IF($I$4=Dates1!$B$5,Datapack!N5,IF($I$4=Dates1!$B$6,Datapack!T5))))","v":103},{"$f":"K10/$I10*100","v":14.548022598870055},null,{"$f":"IF($I$4=Dates1!$B$3,Datapack!C5,IF($I$4=Dates1!$B$4,Datapack!I5,IF($I$4=Dates1!$B$5,Datapack!O5,IF($I$4=Dates1!$B$6,Datapack!U5))))","v":369},{"$f":"N10/$I10*100","v":52.118644067796616},null,{"$f":"IF($I$4=Dates1!$B$3,Datapack!D5,IF($I$4=Dates1!$B$4,Datapack!J5,IF($I$4=Dates1!$B$5,Datapack!P5,IF($I$4=Dates1!$B$6,Datapack!V5))))","v":220},{"$f":"Q10/$I10*100","v":31.073446327683619},null,{"$f":"IF($I$4=Dates1!$B$3,Datapack!E5,IF($I$4=Dates1!$B$4,Datapack!K5,IF($I$4=Dates1!$B$5,Datapack!Q5,IF($I$4=Dates1!$B$6,Datapack!W5))))","v":16},{"$f":"T10/$I10*100","v":2.2598870056497176}]
{"$rows_left_out":26}
{"sheet":"Table 3","index":6,"n_rows":36,"n_cols":21,"rows_kept":36,"cut":false,"hidden":false,"merged":[[36,1,37,20],[26,1,26,6],[34,1,34,6],[35,1,35,8],[28,1,28,6],[29,1,29,6],[30,1,30,6],[27,1,27,6],[33,1,33,20],[25,1,25,6],[23,1,23,6],[24,1,24,6],[21,1,21,6],[22,1,22,6],[19,1,19,6],[20,1,20,6],[16,1,16,6],[18,1,18,6],[4,19,4,20],[7,1,7,6],[8,1,8,6],[9,1,9,6],[4,8,5,8],[17,1,17,6],[13,1,13,6],[1,1,1,20],[10,1,10,6],[11,1,11,6],[12,1,12,6],[31,17,31,20],[4,10,4,11],[4,13,4,14],[4,16,4,17],[14,1,14,6],[15,1,15,6]]}
[]
[null,"Table 3: Most recent inspection outcomes of children's centres as at 31 August 20121 2"]
[]
[]
[{"$nulls":8},"Total number inspected",null,"Outstanding",null,null,"Good",null,null,"Satisfactory",null,null,"Inadequate"]
[{"$nulls":10},"Number","%",null,"Number","%",null,"Number","%",null,"Number","%"]
[]
[null,"The effectiveness of the children’s centre in meeting the needs of and improving outcomes for families",{"$nulls":6},{"$f":"SUM(K8+N8+Q8+T8)","v":1443},null,190,{"$f":"SUM(K8/I8*100)","v":13.167013167013167},null,814,{"$f":"SUM(N8/I8*100)","v":56.410256410256409},null,419,{"$f":"SUM(Q8/I8*100)","v":29.036729036729035},null,20,{"$f":"SUM(T8/I8*100)","v":1.386001386001386}]
[null,"The centre’s capacity for sustained improvement, including the quality of its leadership and management",{"$nulls":6},{"$f":"SUM(K9+N9+Q9+T9)","v":1443},null,221,{"$f":"SUM(K9/I9*100)","v":15.315315315315313},null,804,{"$f":"SUM(N9/I9*100)","v":55.717255717255718},null,398,{"$f":"SUM(Q9/I9*100)","v":27.58142758142758},null,20,{"$f":"SUM(T9/I9*100)","v":1.386001386001386}]
[null,"How good are outcomes for families?",{"$nulls":6},1443,null,182,12.612612612612612,null,857,59.39015939015939,null,387,26.819126819126822,null,17,1.1781011781011781]
{"$rows_left_out":27}
{"sheet":"Table 4","index":7,"n_rows":13,"n_cols":15,"rows_kept":13,"cut":false,"hidden":false,"merged":[[4,10,4,11],[4,13,4,14],[12,11,12,14],[1,1,1,17],[4,1,5,1],[4,2,5,2],[4,4,4,5],[4,7,4,8]]}
[]
[null,"Table 4: Overall effectiveness of children's centres inspected over two inspection years"]
[]
[]
[null,null,"Total number inspected",null,"Outstanding",null,null,"Good",null,null,"Satisfactory",null,null,"Inadequate"]
[{"$nulls":4},"Number","%",null,"Number","%",null,"Number","%",null,"Number","%"]
[]
[null,"1 September 2011 and 31 August 2012",708,null,86,{"$f":"E8/C8*100","v":12.146892655367232},null,378,{"$f":"H8/C8*100","v":53.389830508474581},null,226,{"$f":"K8/C8*100","v":31.92090395480226},null,18,{"$f":"N8/C8*100","v":2.5423728813559325}]
[]
[]
{"$rows_left_out":4}
{"sheet":"Table 5","index":8,"n_rows":181,"n_cols":14,"rows_kept":181,"cut":false,"hidden":false,"merged":[[11,1,11,3],[12,1,12,3],[13,1,13,3],[14,1,14,3],[10,1,10,3],[7,1,7,3],[9,1,9,3],[19,1,19,3],[20,1,20,3],[21,1,21,3],[23,1,23,3],[15,1,15,3],[16,1,16,3],[17,1,17,3],[18,1,18,3],[28,1,28,3],[29,1,29,3],[30,1,30,3],[31,1,31,3],[24,1,24,3],[25,1,25,3],[26,1,26,3],[27,1,27,3],[36,1,36,3],[37,1,37,3],[38,1,38,3],[39,1,39,3],[32,1,32,3],[33,1,33,3],[34,1,34,3],[35,1,35,3],[44,1,44,3],[45,1,45,3],[46,1,46,3],[48,1,48,3],[40,1,40,3],[41,1,41,3],[42,1,42,3],[43,1,43,3],[53,1,53,3],[54,1,54,3],[55,1,55,3],[56,1,56,3],[49,1,49,3],[50,1,50,3],[51,1,51,3],[52,1,52,3],[61,1,61,3],[62,1,62,3],[63,1,63,3],[65,1,65,3],[57,1,57,3],[58,1,58,3],[59,1,59,3],[60,1,60,3],[70,1,70,3],[71,1,71,3],[72,1,72,3],[73,1,73,3],[66,1,66,3],[67,1,67,3],[68,1,68,3],[69,1,69,3],[79,1,79,3],[80,1,80,3],[81,1,81,3],[82,1,82,3],[74,1,74,3],[76,1,76,3],[77,1,77,3],[78,1,78,3],[87,1,87,3],[88,1,88,3],[89,1,89,3],[90,1,90,3],[83,1,83,3],[84,1,84,3],[85,1,85,3],[86,1,86,3],[96,1,96,3],[97,1,97,3],[98,1,98,3],[99,1,99,3],[92,1,92,3],[93,1,93,3],[94,1,94,3],[95,1,95,3],[105,1,105,3],[106,1,106,3],[107,1,107,3],[108,1,108,3],[100,1,100,3],[101,1,101,3],[102,1,102,3],[103,1,103,3],[113,1,113,3],[114,1,114,3],[115,1,115,3],[116,1,116,3],[109,1,109,3],[110,1,110,3],[111,1,111,3],[112,1,112,3],[121,1,121,3],[122,1,122,3],[123,1,123,3],[124,1,124,3],[117,1,117,3],[118,1,118,3],[119,1,119,3],[120,1,120,3],[129,1,129,3],[130,1,130,3],[131,1,131,3],[132,1,132,3],[125,1,125,3],[126,1,126,3],[127,1,127,3],[128,1,128,3],[162,1,162,3],[137,1,137,3],[138,1,138,3],[140,1,140,3],[141,1,141,3],[133,1,133,3],[134,1,134,3],[135,1,135,3],[136,1,136,3],[146,1,146,3],[147,1,147,3],[148,1,148,3],[149,1,149,3],[142,1,142,3],[143,1,143,3],[144,1,144,3],[145,1,145,3],[164,1,164,3],[165,1,165,3],[166,1,166,3],[150,1,150,3],[151,1,151,3],[152,1,152,3],[153,1,153,3],[154,1,154,3],[155,1,155,3],[163,1,163,3],[173,1,173,3],[174,1,174,3],[175,1,175,3],[176,1,176,3],[170,1,170,3],[156,1,156,3],[157,1,157,3],[158,1,158,3],[159,1,159,3],[161,1,161,3],[3,6,3,11],[180,1,180,5],[179,11,179,13],[1,1,1,20],[171,1,171,3],[167,1,167,3],[168,1,168,3],[169,1,169,3],[177,1,177,3],[172,1,172,3]]}
[]
[null,{"$f":"\"Table 5: Overall effectiveness of children's centres inspected \"&IF('Table 5'!G4=Dates1!$B$3,\"between \"&Dates1!$B$3,IF('Table 5'!G4=Dates1!B4,\"in \"&Dates1!B4,IF('Table 5'!G4=Dates1!B5,\"in \"&Dates1!B5,IF('Table 5'!G4=Dates1!B6,\"in \"&Dates1!B6))))&\", by local authority\"&\"\"&CHAR(185)&\"\"","v":"Table 5: Overall effectiveness of children's centres inspected between 1 September 2011 and 31 August 2012, by local authority¹"}]
[]
[{"$nulls":6},"1 September 2011 and 31 August 2012"]
[]
[{"$nulls":5},"Total number inspected",null,"Outstanding",null,"Good",null,"Satisfactory",null,"Inadequate"]
[]
[null,"ENGLAND ",null,null,null,{"$f":"SUM(F10+F24+F49+F66+F77+F93+F106+F141+F162)","v":708},null,{"$f":"SUM(H10+H24+H49+H66+H77+H93+H106+H141+H162)","v":86},null,378,null,226,null,18]
[]
[null,"NORTH EAST ",null,null,null,{"$f":"SUM(F11:F22)","v":36},null,{"$f":"SUM(H11:H22)","v":4},null,{"$f":"SUM(J11:J22)","v":24},null,{"$f":"SUM(L11:L22)","v":6},null,{"$f":"SUM(N11:N22)","v":2}]
{"$rows_left_out":172}
{"sheet":"Table 6","index":9,"n_rows":182,"n_cols":18,"rows_kept":182,"cut":false,"hidden":false,"merged":[[170,1,170,3],[176,1,176,3],[177,1,177,3],[172,1,172,3],[173,1,173,3],[174,1,174,3],[175,1,175,3],[171,1,171,3],[167,1,167,3],[159,1,159,3],[161,1,161,3],[162,1,162,3],[163,1,163,3],[169,1,169,3],[153,1,153,3],[154,1,154,3],[168,1,168,3],[155,1,155,3],[156,1,156,3],[157,1,157,3],[158,1,158,3],[164,1,164,3],[165,1,165,3],[166,1,166,3],[147,1,147,3],[148,1,148,3],[149,1,149,3],[150,1,150,3],[151,1,151,3],[152,1,152,3],[141,1,141,3],[142,1,142,3],[143,1,143,3],[144,1,144,3],[145,1,145,3],[146,1,146,3],[134,1,134,3],[135,1,135,3],[136,1,136,3],[137,1,137,3],[138,1,138,3],[140,1,140,3],[128,1,128,3],[129,1,129,3],[130,1,130,3],[131,1,131,3],[132,1,132,3],[133,1,133,3],[122,1,122,3],[123,1,123,3],[124,1,124,3],[125,1,125,3],[126,1,126,3],[127,1,127,3],[116,1,116,3],[117,1,117,3],[118,1,118,3],[119,1,119,3],[120,1,120,3],[121,1,121,3],[110,1,110,3],[111,1,111,3],[112,1,112,3],[113,1,113,3],[114,1,114,3],[115,1,115,3],[103,1,103,3],[105,1,105,3],[106,1,106,3],[107,1,107,3],[108,1,108,3],[109,1,109,3],[97,1,97,3],[98,1,98,3],[99,1,99,3],[100,1,100,3],[101,1,101,3],[102,1,102,3],[90,1,90,3],[92,1,92,3],[93,1,93,3],[94,1,94,3],[95,1,95,3],[96,1,96,3],[84,1,84,3],[85,1,85,3],[86,1,86,3],[87,1,87,3],[88,1,88,3],[89,1,89,3],[78,1,78,3],[79,1,79,3],[80,1,80,3],[81,1,81,3],[82,1,82,3],[83,1,83,3],[71,1,71,3],[72,1,72,3],[73,1,73,3],[74,1,74,3],[76,1,76,3],[77,1,77,3],[65,1,65,3],[66,1,66,3],[67,1,67,3],[68,1,68,3],[69,1,69,3],[70,1,70,3],[58,1,58,3],[59,1,59,3],[60,1,60,3],[61,1,61,3],[62,1,62,3],[63,1,63,3],[52,1,52,3],[53,1,53,3],[54,1,54,3],[55,1,55,3],[56,1,56,3],[57,1,57,3],[45,1,45,3],[46,1,46,3],[48,1,48,3],[49,1,49,3],[50,1,50,3],[51,1,51,3],[39,1,39,3],[40,1,40,3],[41,1,41,3],[42,1,42,3],[43,1,43,3],[44,1,44,3],[33,1,33,3],[34,1,34,3],[35,1,35,3],[36,1,36,3],[37,1,37,3],[38,1,38,3],[27,1,27,3],[28,1,28,3],[29,1,29,3],[30,1,30,3],[31,1,31,3],[32,1,32,3],[20,1,20,3],[21,1,21,3],[23,1,23,3],[24,1,24,3],[25,1,25,3],[26,1,26,3],[14,1,14,3],[15,1,15,3],[16,1,16,3],[17,1,17,3],[18,1,18,3],[19,1,19,3],[7,1,7,3],[9,1,9,3],[10,1,10,3],[11,1,11,3],[12,1,12,3],[13,1,13,3],[1,1,1,20],[4,5,5,5],[4,7,4,8],[4,10,4,11],[4,13,4,14],[4,16,4,17]]}
[]
[null,"Table 6: Overall effectiveness of children's centres inspected as at 31 August 2012, by local authority1 2"]
[]
[]
[{"$nulls":5},"Total number inspected",null,"Outstanding",null,null,"Good",null,null,"Satisfactory",null,null,"Inadequate"]
[{"$nulls":7},"Number","%",null,"Number","%",null,"Number","%",null,"Number","%"]
[]
[null,"ENGLAND ",null,null,null,{"$f":"SUM(F10+F24+F49+F66+F77+F93+F106+F141+F162)","v":1443},null,{"$f":"SUM(H10+H24+H49+H66+H77+H93+H106+H141+H162)","v":190},{"$f":"SUM(H8/F8*100)","v":13.167013167013167},null,{"$f":"SUM(K10+K24+K49+K66+K77+K93+K106+K141+K162)","v":814},{"$f":"SUM(K8/F8*100)","v":56.410256410256409},null,{"$f":"SUM(N10+N24+N49+N66+N77+N93+N106+N141+N162)","v":419},{"$f":"SUM(N8/F8*100)","v":29.036729036729035},null,{"$f":"SUM(Q10+Q24+Q49+Q66+Q77+Q93+Q106+Q141+Q162)","v":20},{"$f":"SUM(Q8/F8*100)","v":1.386001386001386}]
[]
[null,"NORTH EAST ",null,null,null,{"$f":"SUM(H10+K10+N10+Q10)","v":96},null,{"$f":"SUM(H11:H22)","v":11},{"$f":"SUM(H10/F10*100)","v":11.458333333333332},null,{"$f":"SUM(K11:K22)","v":70},{"$f":"SUM(K10/F10*100)","v":72.916666666666657},null,{"$f":"SUM(N11:N22)","v":13},{"$f":"SUM(N10/F10*100)","v":13.541666666666666},null,{"$f":"SUM(Q11:Q22)","v":2},{"$f":"SUM(Q10/F10*100)","v":2.083333333333333}]
{"$rows_left_out":173}
{"sheet":"Chart 1","index":10,"n_rows":17,"n_cols":7,"rows_kept":17,"cut":false,"hidden":false,"merged":[[4,15,4,19],[8,21,8,24],[9,28,9,29],[6,21,6,24],[7,21,7,24],[2,64,2,79],[2,80,2,95],[2,96,2,111],[2,112,2,127],[2,16,2,31],[2,32,2,47],[2,48,2,63],[1,1,1,8],[15,6,15,7],[2,224,2,239],[2,240,2,255],[2,128,2,143],[2,144,2,159],[2,160,2,175],[2,176,2,191],[2,192,2,207],[2,208,2,223]]}
[]
[null,"Chart 1: Key judgements of children's centres inspected between 1 September 2011 and 31 August 20121"]
{"$rows_empty":13}
[{"$nulls":6},"Source: Ofsted Inspections"]
[null,"1. Percentages are rounded and may not add to 100."]

{"sheet":"Chart 2","index":11,"n_rows":26,"n_cols":11,"rows_kept":26,"cut":false,"hidden":false,"merged":[[1,1,1,13],[27,1,28,10],[24,10,24,12]]}
[]
[null,"Chart 2: Overall effectiveness of children's centres inspected over two inspection years1"]
{"$rows_empty":22}
[{"$nulls":10},"Source: Ofsted Inspections"]
[null,"1. Percentages are rounded and may not add to 100."]